{"text_format":"1","workbook":"xlsx","n_sheets":2,"sheets":["Saisie de données","Références"],"not_rendered":{"charts":0,"images":6,"macros":1,"external_links":0,"defined_names":1,"comments":1,"pivot_tables":0},"unopened":[],"bounds":{"document_bytes":16777216,"sheet_cells":100000,"rows_first":2000,"rows_last":500,"rows_between":2000,"halvings":0,"cell_chars":16384,"cell_head_chars":4096},"cells_cut":0,"cells_raw":0,"read":"whole","date_system":"1900"}

{"sheet":"Saisie de données","index":0,"n_rows":1010,"n_cols":6,"rows_kept":1010,"cut":false,"hidden":false,"merged":[[1,1,1,5],[3,1,3,2],[8,2,8,5]]}
[]
[null,"Calculateur multi-déplacements"]
[]
[null,"Nombre de participants total à l'événement",null,null,"Total en tonne CO2e",{"$f":"IF(F11=\"\",\"\",IF(C5=TRUE,((SUM(F11:F1010)/1000)/COUNT(F11:F1010)*IF(D4=0,0,D4)),IF(D4=0,0,SUM(F11:F1010)/1000)))","v":""}]
[null,null,false,null,null,{"$f":"IF(F11=\"\",\"\",CONCATENATE(ROUNDUP(F4/Références!C16,0),\" arbres\"))","v":""}]
[null,null,null,null,"Montant à compenser",{"$f":"IF(F11=\"\",\"\",ROUNDUP(F4/Références!C16,0)*Références!C17)","v":""}]
[]
[]
[null,null,"Notes: \n\n1- Pour le co-voiturage, chacun des passagers devrait remplir le formulaire. Si une seule personne remplit le formulaire, ne pas entrer le nombre de passagers.\n\n2- Dans le cas où seulement une partie des participants ont rempli ce formulaire, il est possible de calculer les émissions pour l'ensemble de ceux-ci en cochant la case intitulée \"Calculer pour l'ensemble des participants\". Le calcul est effectué à partir de la moyenne des émissions par individu."]
[null,"Participant","Moyen de transport","Nombre de passagers (pour automobile seulement)","Distance aller-retour (km)","Émissions (kg CO2e)"]
[null,1,null,null,null,{"$f":"IF(E11=\"\",\"\",IF(C11=\"Automobile\",Références!C$4*E11/IF(D11=\"\",1,D11),IF(C11=\"Avion\",IF(E11<500,Références!C$10*E11,IF(E11<1600,Références!C$11*E11,IF(E11<3600,Références!C$12*E11,IF(E11>=3600,Références!C$13*E11)))),VLOOKUP(C11,Références!B$3:C$7,2)*E11)))","v":""}]
[null,2,null,null,null,{"$f":"IF(E12=\"\",\"\",IF(C12=\"Automobile\",Références!C$4*E12/IF(D12=\"\",1,D12),IF(C12=\"Avion\",IF(E12<500,Références!C$10*E12,IF(E12<1600,Références!C$11*E12,IF(E12<3600,Références!C$12*E12,IF(E12>=3600,Références!C$13*E12)))),VLOOKUP(C12,Références!B$3:C$7,2)*E12)))","v":""}]
[null,3,null,null,null,{"$f":"IF(E13=\"\",\"\",IF(C13=\"Automobile\",Références!C$4*E13/IF(D13=\"\",1,D13),IF(C13=\"Avion\",IF(E13<500,Références!C$10*E13,IF(E13<1600,Références!C$11*E13,IF(E13<3600,Références!C$12*E13,IF(E13>=3600,Références!C$13*E13)))),VLOOKUP(C13,Références!B$3:C$7,2)*E13)))","v":""}]
[null,4,null,null,null,{"$f":"IF(E14=\"\",\"\",IF(C14=\"Automobile\",Références!C$4*E14/IF(D14=\"\",1,D14),IF(C14=\"Avion\",IF(E14<500,Références!C$10*E14,IF(E14<1600,Références!C$11*E14,IF(E14<3600,Références!C$12*E14,IF(E14>=3600,Références!C$13*E14)))),VLOOKUP(C14,Références!B$3:C$7,2)*E14)))","v":""}]
[null,5,null,null,null,{"$f":"IF(E15=\"\",\"\",IF(C15=\"Automobile\",Références!C$4*E15/IF(D15=\"\",1,D15),IF(C15=\"Avion\",IF(E15<500,Références!C$10*E15,IF(E15<1600,Références!C$11*E15,IF(E15<3600,Références!C$12*E15,IF(E15>=3600,Références!C$13*E15)))),VLOOKUP(C15,Références!B$3:C$7,2)*E15)))","v":""}]
[null,6,null,null,null,{"$f":"IF(E16=\"\",\"\",IF(C16=\"Automobile\",Références!C$4*E16/IF(D16=\"\",1,D16),IF(C16=\"Avion\",IF(E16<500,Références!C$10*E16,IF(E16<1600,Références!C$11*E16,IF(E16<3600,Références!C$12*E16,IF(E16>=3600,Références!C$13*E16)))),VLOOKUP(C16,Références!B$3:C$7,2)*E16)))","v":""}]
[null,7,null,null,null,{"$f":"IF(E17=\"\",\"\",IF(C17=\"Automobile\",Références!C$4*E17/IF(D17=\"\",1,D17),IF(C17=\"Avion\",IF(E17<500,Références!C$10*E17,IF(E17<1600,Références!C$11*E17,IF(E17<3600,Références!C$12*E17,IF(E17>=3600,Références!C$13*E17)))),VLOOKUP(C17,Références!B$3:C$7,2)*E17)))","v":""}]
[null,8,null,null,null,{"$f":"IF(E18=\"\",\"\",IF(C18=\"Automobile\",Références!C$4*E18/IF(D18=\"\",1,D18),IF(C18=\"Avion\",IF(E18<500,Références!C$10*E18,IF(E18<1600,Références!C$11*E18,IF(E18<3600,Références!C$12*E18,IF(E18>=3600,Références!C$13*E18)))),VLOOKUP(C18,Références!B$3:C$7,2)*E18)))","v":""}]
[null,9,null,null,null,{"$f":"IF(E19=\"\",\"\",IF(C19=\"Automobile\",Références!C$4*E19/IF(D19=\"\",1,D19),IF(C19=\"Avion\",IF(E19<500,Références!C$10*E19,IF(E19<1600,Références!C$11*E19,IF(E19<3600,Références!C$12*E19,IF(E19>=3600,Références!C$13*E19)))),VLOOKUP(C19,Références!B$3:C$7,2)*E19)))","v":""}]
[null,10,null,null,null,{"$f":"IF(E20=\"\",\"\",IF(C20=\"Automobile\",Références!C$4*E20/IF(D20=\"\",1,D20),IF(C20=\"Avion\",IF(E20<500,Références!C$10*E20,IF(E20<1600,Références!C$11*E20,IF(E20<3600,Références!C$12*E20,IF(E20>=3600,Références!C$13*E20)))),VLOOKUP(C20,Références!B$3:C$7,2)*E20)))","v":""}]
[null,11,null,null,null,{"$f":"IF(E21=\"\",\"\",IF(C21=\"Automobile\",Références!C$4*E21/IF(D21=\"\",1,D21),IF(C21=\"Avion\",IF(E21<500,Références!C$10*E21,IF(E21<1600,Références!C$11*E21,IF(E21<3600,Références!C$12*E21,IF(E21>=3600,Références!C$13*E21)))),VLOOKUP(C21,Références!B$3:C$7,2)*E21)))","v":""}]
[null,12,null,null,null,{"$f":"IF(E22=\"\",\"\",IF(C22=\"Automobile\",Références!C$4*E22/IF(D22=\"\",1,D22),IF(C22=\"Avion\",IF(E22<500,Références!C$10*E22,IF(E22<1600,Références!C$11*E22,IF(E22<3600,Références!C$12*E22,IF(E22>=3600,Références!C$13*E22)))),VLOOKUP(C22,Références!B$3:C$7,2)*E22)))","v":""}]
[null,13,null,null,null,{"$f":"IF(E23=\"\",\"\",IF(C23=\"Automobile\",Références!C$4*E23/IF(D23=\"\",1,D23),IF(C23=\"Avion\",IF(E23<500,Références!C$10*E23,IF(E23<1600,Références!C$11*E23,IF(E23<3600,Références!C$12*E23,IF(E23>=3600,Références!C$13*E23)))),VLOOKUP(C23,Références!B$3:C$7,2)*E23)))","v":""}]
[null,14,null,null,null,{"$f":"IF(E24=\"\",\"\",IF(C24=\"Automobile\",Références!C$4*E24/IF(D24=\"\",1,D24),IF(C24=\"Avion\",IF(E24<500,Références!C$10*E24,IF(E24<1600,Références!C$11*E24,IF(E24<3600,Références!C$12*E24,IF(E24>=3600,Références!C$13*E24)))),VLOOKUP(C24,Références!B$3:C$7,2)*E24)))","v":""}]
[null,15,null,null,null,{"$f":"IF(E25=\"\",\"\",IF(C25=\"Automobile\",Références!C$4*E25/IF(D25=\"\",1,D25),IF(C25=\"Avion\",IF(E25<500,Références!C$10*E25,IF(E25<1600,Références!C$11*E25,IF(E25<3600,Références!C$12*E25,IF(E25>=3600,Références!C$13*E25)))),VLOOKUP(C25,Références!B$3:C$7,2)*E25)))","v":""}]
[null,16,null,null,null,{"$f":"IF(E26=\"\",\"\",IF(C26=\"Automobile\",Références!C$4*E26/IF(D26=\"\",1,D26),IF(C26=\"Avion\",IF(E26<500,Références!C$10*E26,IF(E26<1600,Références!C$11*E26,IF(E26<3600,Références!C$12*E26,IF(E26>=3600,Références!C$13*E26)))),VLOOKUP(C26,Références!B$3:C$7,2)*E26)))","v":""}]
[null,17,null,null,null,{"$f":"IF(E27=\"\",\"\",IF(C27=\"Automobile\",Références!C$4*E27/IF(D27=\"\",1,D27),IF(C27=\"Avion\",IF(E27<500,Références!C$10*E27,IF(E27<1600,Références!C$11*E27,IF(E27<3600,Références!C$12*E27,IF(E27>=3600,Références!C$13*E27)))),VLOOKUP(C27,Références!B$3:C$7,2)*E27)))","v":""}]
[null,18,null,null,null,{"$f":"IF(E28=\"\",\"\",IF(C28=\"Automobile\",Références!C$4*E28/IF(D28=\"\",1,D28),IF(C28=\"Avion\",IF(E28<500,Références!C$10*E28,IF(E28<1600,Références!C$11*E28,IF(E28<3600,Références!C$12*E28,IF(E28>=3600,Références!C$13*E28)))),VLOOKUP(C28,Références!B$3:C$7,2)*E28)))","v":""}]
[null,19,null,null,null,{"$f":"IF(E29=\"\",\"\",IF(C29=\"Automobile\",Références!C$4*E29/IF(D29=\"\",1,D29),IF(C29=\"Avion\",IF(E29<500,Références!C$10*E29,IF(E29<1600,Références!C$11*E29,IF(E29<3600,Références!C$12*E29,IF(E29>=3600,Références!C$13*E29)))),VLOOKUP(C29,Références!B$3:C$7,2)*E29)))","v":""}]
[null,20,null,null,null,{"$f":"IF(E30=\"\",\"\",IF(C30=\"Automobile\",Références!C$4*E30/IF(D30=\"\",1,D30),IF(C30=\"Avion\",IF(E30<500,Références!C$10*E30,IF(E30<1600,Références!C$11*E30,IF(E30<3600,Références!C$12*E30,IF(E30>=3600,Références!C$13*E30)))),VLOOKUP(C30,Références!B$3:C$7,2)*E30)))","v":""}]
[null,21,null,null,null,{"$f":"IF(E31=\"\",\"\",IF(C31=\"Automobile\",Références!C$4*E31/IF(D31=\"\",1,D31),IF(C31=\"Avion\",IF(E31<500,Références!C$10*E31,IF(E31<1600,Références!C$11*E31,IF(E31<3600,Références!C$12*E31,IF(E31>=3600,Références!C$13*E31)))),VLOOKUP(C31,Références!B$3:C$7,2)*E31)))","v":""}]
[null,22,null,null,null,{"$f":"IF(E32=\"\",\"\",IF(C32=\"Automobile\",Références!C$4*E32/IF(D32=\"\",1,D32),IF(C32=\"Avion\",IF(E32<500,Références!C$10*E32,IF(E32<1600,Références!C$11*E32,IF(E32<3600,Références!C$12*E32,IF(E32>=3600,Références!C$13*E32)))),VLOOKUP(C32,Références!B$3:C$7,2)*E32)))","v":""}]
[null,23,null,null,null,{"$f":"IF(E33=\"\",\"\",IF(C33=\"Automobile\",Références!C$4*E33/IF(D33=\"\",1,D33),IF(C33=\"Avion\",IF(E33<500,Références!C$10*E33,IF(E33<1600,Références!C$11*E33,IF(E33<3600,Références!C$12*E33,IF(E33>=3600,Références!C$13*E33)))),VLOOKUP(C33,Références!B$3:C$7,2)*E33)))","v":""}]
[null,24,null,null,null,{"$f":"IF(E34=\"\",\"\",IF(C34=\"Automobile\",Références!C$4*E34/IF(D34=\"\",1,D34),IF(C34=\"Avion\",IF(E34<500,Références!C$10*E34,IF(E34<1600,Références!C$11*E34,IF(E34<3600,Références!C$12*E34,IF(E34>=3600,Références!C$13*E34)))),VLOOKUP(C34,Références!B$3:C$7,2)*E34)))","v":""}]
[null,25,null,null,null,{"$f":"IF(E35=\"\",\"\",IF(C35=\"Automobile\",Références!C$4*E35/IF(D35=\"\",1,D35),IF(C35=\"Avion\",IF(E35<500,Références!C$10*E35,IF(E35<1600,Références!C$11*E35,IF(E35<3600,Références!C$12*E35,IF(E35>=3600,Références!C$13*E35)))),VLOOKUP(C35,Références!B$3:C$7,2)*E35)))","v":""}]
[null,26,null,null,null,{"$f":"IF(E36=\"\",\"\",IF(C36=\"Automobile\",Références!C$4*E36/IF(D36=\"\",1,D36),IF(C36=\"Avion\",IF(E36<500,Références!C$10*E36,IF(E36<1600,Références!C$11*E36,IF(E36<3600,Références!C$12*E36,IF(E36>=3600,Références!C$13*E36)))),VLOOKUP(C36,Références!B$3:C$7,2)*E36)))","v":""}]
[null,27,null,null,null,{"$f":"IF(E37=\"\",\"\",IF(C37=\"Automobile\",Références!C$4*E37/IF(D37=\"\",1,D37),IF(C37=\"Avion\",IF(E37<500,Références!C$10*E37,IF(E37<1600,Références!C$11*E37,IF(E37<3600,Références!C$12*E37,IF(E37>=3600,Références!C$13*E37)))),VLOOKUP(C37,Références!B$3:C$7,2)*E37)))","v":""}]
[null,28,null,null,null,{"$f":"IF(E38=\"\",\"\",IF(C38=\"Automobile\",Références!C$4*E38/IF(D38=\"\",1,D38),IF(C38=\"Avion\",IF(E38<500,Références!C$10*E38,IF(E38<1600,Références!C$11*E38,IF(E38<3600,Références!C$12*E38,IF(E38>=3600,Références!C$13*E38)))),VLOOKUP(C38,Références!B$3:C$7,2)*E38)))","v":""}]
[null,29,null,null,null,{"$f":"IF(E39=\"\",\"\",IF(C39=\"Automobile\",Références!C$4*E39/IF(D39=\"\",1,D39),IF(C39=\"Avion\",IF(E39<500,Références!C$10*E39,IF(E39<1600,Références!C$11*E39,IF(E39<3600,Références!C$12*E39,IF(E39>=3600,Références!C$13*E39)))),VLOOKUP(C39,Références!B$3:C$7,2)*E39)))","v":""}]
[null,30,null,null,null,{"$f":"IF(E40=\"\",\"\",IF(C40=\"Automobile\",Références!C$4*E40/IF(D40=\"\",1,D40),IF(C40=\"Avion\",IF(E40<500,Références!C$10*E40,IF(E40<1600,Références!C$11*E40,IF(E40<3600,Références!C$12*E40,IF(E40>=3600,Références!C$13*E40)))),VLOOKUP(C40,Références!B$3:C$7,2)*E40)))","v":""}]
[null,31,null,null,null,{"$f":"IF(E41=\"\",\"\",IF(C41=\"Automobile\",Références!C$4*E41/IF(D41=\"\",1,D41),IF(C41=\"Avion\",IF(E41<500,Références!C$10*E41,IF(E41<1600,Références!C$11*E41,IF(E41<3600,Références!C$12*E41,IF(E41>=3600,Références!C$13*E41)))),VLOOKUP(C41,Références!B$3:C$7,2)*E41)))","v":""}]
[null,32,null,null,null,{"$f":"IF(E42=\"\",\"\",IF(C42=\"Automobile\",Références!C$4*E42/IF(D42=\"\",1,D42),IF(C42=\"Avion\",IF(E42<500,Références!C$10*E42,IF(E42<1600,Références!C$11*E42,IF(E42<3600,Références!C$12*E42,IF(E42>=3600,Références!C$13*E42)))),VLOOKUP(C42,Références!B$3:C$7,2)*E42)))","v":""}]
[null,33,null,null,null,{"$f":"IF(E43=\"\",\"\",IF(C43=\"Automobile\",Références!C$4*E43/IF(D43=\"\",1,D43),IF(C43=\"Avion\",IF(E43<500,Références!C$10*E43,IF(E43<1600,Références!C$11*E43,IF(E43<3600,Références!C$12*E43,IF(E43>=3600,Références!C$13*E43)))),VLOOKUP(C43,Références!B$3:C$7,2)*E43)))","v":""}]
[null,34,null,null,null,{"$f":"IF(E44=\"\",\"\",IF(C44=\"Automobile\",Références!C$4*E44/IF(D44=\"\",1,D44),IF(C44=\"Avion\",IF(E44<500,Références!C$10*E44,IF(E44<1600,Références!C$11*E44,IF(E44<3600,Références!C$12*E44,IF(E44>=3600,Références!C$13*E44)))),VLOOKUP(C44,Références!B$3:C$7,2)*E44)))","v":""}]
[null,35,null,null,null,{"$f":"IF(E45=\"\",\"\",IF(C45=\"Automobile\",Références!C$4*E45/IF(D45=\"\",1,D45),IF(C45=\"Avion\",IF(E45<500,Références!C$10*E45,IF(E45<1600,Références!C$11*E45,IF(E45<3600,Références!C$12*E45,IF(E45>=3600,Références!C$13*E45)))),VLOOKUP(C45,Références!B$3:C$7,2)*E45)))","v":""}]
[null,36,null,null,null,{"$f":"IF(E46=\"\",\"\",IF(C46=\"Automobile\",Références!C$4*E46/IF(D46=\"\",1,D46),IF(C46=\"Avion\",IF(E46<500,Références!C$10*E46,IF(E46<1600,Références!C$11*E46,IF(E46<3600,Références!C$12*E46,IF(E46>=3600,Références!C$13*E46)))),VLOOKUP(C46,Références!B$3:C$7,2)*E46)))","v":""}]
[null,37,null,null,null,{"$f":"IF(E47=\"\",\"\",IF(C47=\"Automobile\",Références!C$4*E47/IF(D47=\"\",1,D47),IF(C47=\"Avion\",IF(E47<500,Références!C$10*E47,IF(E47<1600,Références!C$11*E47,IF(E47<3600,Références!C$12*E47,IF(E47>=3600,Références!C$13*E47)))),VLOOKUP(C47,Références!B$3:C$7,2)*E47)))","v":""}]
[null,38,null,null,null,{"$f":"IF(E48=\"\",\"\",IF(C48=\"Automobile\",Références!C$4*E48/IF(D48=\"\",1,D48),IF(C48=\"Avion\",IF(E48<500,Références!C$10*E48,IF(E48<1600,Références!C$11*E48,IF(E48<3600,Références!C$12*E48,IF(E48>=3600,Références!C$13*E48)))),VLOOKUP(C48,Références!B$3:C$7,2)*E48)))","v":""}]
[null,39,null,null,null,{"$f":"IF(E49=\"\",\"\",IF(C49=\"Automobile\",Références!C$4*E49/IF(D49=\"\",1,D49),IF(C49=\"Avion\",IF(E49<500,Références!C$10*E49,IF(E49<1600,Références!C$11*E49,IF(E49<3600,Références!C$12*E49,IF(E49>=3600,Références!C$13*E49)))),VLOOKUP(C49,Références!B$3:C$7,2)*E49)))","v":""}]
[null,40,null,null,null,{"$f":"IF(E50=\"\",\"\",IF(C50=\"Automobile\",Références!C$4*E50/IF(D50=\"\",1,D50),IF(C50=\"Avion\",IF(E50<500,Références!C$10*E50,IF(E50<1600,Références!C$11*E50,IF(E50<3600,Références!C$12*E50,IF(E50>=3600,Références!C$13*E50)))),VLOOKUP(C50,Références!B$3:C$7,2)*E50)))","v":""}]
[null,41,null,null,null,{"$f":"IF(E51=\"\",\"\",IF(C51=\"Automobile\",Références!C$4*E51/IF(D51=\"\",1,D51),IF(C51=\"Avion\",IF(E51<500,Références!C$10*E51,IF(E51<1600,Références!C$11*E51,IF(E51<3600,Références!C$12*E51,IF(E51>=3600,Références!C$13*E51)))),VLOOKUP(C51,Références!B$3:C$7,2)*E51)))","v":""}]
[null,42,null,null,null,{"$f":"IF(E52=\"\",\"\",IF(C52=\"Automobile\",Références!C$4*E52/IF(D52=\"\",1,D52),IF(C52=\"Avion\",IF(E52<500,Références!C$10*E52,IF(E52<1600,Références!C$11*E52,IF(E52<3600,Références!C$12*E52,IF(E52>=3600,Références!C$13*E52)))),VLOOKUP(C52,Références!B$3:C$7,2)*E52)))","v":""}]
[null,43,null,null,null,{"$f":"IF(E53=\"\",\"\",IF(C53=\"Automobile\",Références!C$4*E53/IF(D53=\"\",1,D53),IF(C53=\"Avion\",IF(E53<500,Références!C$10*E53,IF(E53<1600,Références!C$11*E53,IF(E53<3600,Références!C$12*E53,IF(E53>=3600,Références!C$13*E53)))),VLOOKUP(C53,Références!B$3:C$7,2)*E53)))","v":""}]
[null,44,null,null,null,{"$f":"IF(E54=\"\",\"\",IF(C54=\"Automobile\",Références!C$4*E54/IF(D54=\"\",1,D54),IF(C54=\"Avion\",IF(E54<500,Références!C$10*E54,IF(E54<1600,Références!C$11*E54,IF(E54<3600,Références!C$12*E54,IF(E54>=3600,Références!C$13*E54)))),VLOOKUP(C54,Références!B$3:C$7,2)*E54)))","v":""}]
[null,45,null,null,null,{"$f":"IF(E55=\"\",\"\",IF(C55=\"Automobile\",Références!C$4*E55/IF(D55=\"\",1,D55),IF(C55=\"Avion\",IF(E55<500,Références!C$10*E55,IF(E55<1600,Références!C$11*E55,IF(E55<3600,Références!C$12*E55,IF(E55>=3600,Références!C$13*E55)))),VLOOKUP(C55,Références!B$3:C$7,2)*E55)))","v":""}]
[null,46,null,null,null,{"$f":"IF(E56=\"\",\"\",IF(C56=\"Automobile\",Références!C$4*E56/IF(D56=\"\",1,D56),IF(C56=\"Avion\",IF(E56<500,Références!C$10*E56,IF(E56<1600,Références!C$11*E56,IF(E56<3600,Références!C$12*E56,IF(E56>=3600,Références!C$13*E56)))),VLOOKUP(C56,Références!B$3:C$7,2)*E56)))","v":""}]
[null,47,null,null,null,{"$f":"IF(E57=\"\",\"\",IF(C57=\"Automobile\",Références!C$4*E57/IF(D57=\"\",1,D57),IF(C57=\"Avion\",IF(E57<500,Références!C$10*E57,IF(E57<1600,Références!C$11*E57,IF(E57<3600,Références!C$12*E57,IF(E57>=3600,Références!C$13*E57)))),VLOOKUP(C57,Références!B$3:C$7,2)*E57)))","v":""}]
[null,48,null,null,null,{"$f":"IF(E58=\"\",\"\",IF(C58=\"Automobile\",Références!C$4*E58/IF(D58=\"\",1,D58),IF(C58=\"Avion\",IF(E58<500,Références!C$10*E58,IF(E58<1600,Références!C$11*E58,IF(E58<3600,Références!C$12*E58,IF(E58>=3600,Références!C$13*E58)))),VLOOKUP(C58,Références!B$3:C$7,2)*E58)))","v":""}]
[null,49,null,null,null,{"$f":"IF(E59=\"\",\"\",IF(C59=\"Automobile\",Références!C$4*E59/IF(D59=\"\",1,D59),IF(C59=\"Avion\",IF(E59<500,Références!C$10*E59,IF(E59<1600,Références!C$11*E59,IF(E59<3600,Références!C$12*E59,IF(E59>=3600,Références!C$13*E59)))),VLOOKUP(C59,Références!B$3:C$7,2)*E59)))","v":""}]
[null,50,null,null,null,{"$f":"IF(E60=\"\",\"\",IF(C60=\"Automobile\",Références!C$4*E60/IF(D60=\"\",1,D60),IF(C60=\"Avion\",IF(E60<500,Références!C$10*E60,IF(E60<1600,Références!C$11*E60,IF(E60<3600,Références!C$12*E60,IF(E60>=3600,Références!C$13*E60)))),VLOOKUP(C60,Références!B$3:C$7,2)*E60)))","v":""}]
[null,51,null,null,null,{"$f":"IF(E61=\"\",\"\",IF(C61=\"Automobile\",Références!C$4*E61/IF(D61=\"\",1,D61),IF(C61=\"Avion\",IF(E61<500,Références!C$10*E61,IF(E61<1600,Références!C$11*E61,IF(E61<3600,Références!C$12*E61,IF(E61>=3600,Références!C$13*E61)))),VLOOKUP(C61,Références!B$3:C$7,2)*E61)))","v":""}]
[null,52,null,null,null,{"$f":"IF(E62=\"\",\"\",IF(C62=\"Automobile\",Références!C$4*E62/IF(D62=\"\",1,D62),IF(C62=\"Avion\",IF(E62<500,Références!C$10*E62,IF(E62<1600,Références!C$11*E62,IF(E62<3600,Références!C$12*E62,IF(E62>=3600,Références!C$13*E62)))),VLOOKUP(C62,Références!B$3:C$7,2)*E62)))","v":""}]
[null,53,null,null,null,{"$f":"IF(E63=\"\",\"\",IF(C63=\"Automobile\",Références!C$4*E63/IF(D63=\"\",1,D63),IF(C63=\"Avion\",IF(E63<500,Références!C$10*E63,IF(E63<1600,Références!C$11*E63,IF(E63<3600,Références!C$12*E63,IF(E63>=3600,Références!C$13*E63)))),VLOOKUP(C63,Références!B$3:C$7,2)*E63)))","v":""}]
[null,54,null,null,null,{"$f":"IF(E64=\"\",\"\",IF(C64=\"Automobile\",Références!C$4*E64/IF(D64=\"\",1,D64),IF(C64=\"Avion\",IF(E64<500,Références!C$10*E64,IF(E64<1600,Références!C$11*E64,IF(E64<3600,Références!C$12*E64,IF(E64>=3600,Références!C$13*E64)))),VLOOKUP(C64,Références!B$3:C$7,2)*E64)))","v":""}]
[null,55,null,null,null,{"$f":"IF(E65=\"\",\"\",IF(C65=\"Automobile\",Références!C$4*E65/IF(D65=\"\",1,D65),IF(C65=\"Avion\",IF(E65<500,Références!C$10*E65,IF(E65<1600,Références!C$11*E65,IF(E65<3600,Références!C$12*E65,IF(E65>=3600,Références!C$13*E65)))),VLOOKUP(C65,Références!B$3:C$7,2)*E65)))","v":""}]
[null,56,null,null,null,{"$f":"IF(E66=\"\",\"\",IF(C66=\"Automobile\",Références!C$4*E66/IF(D66=\"\",1,D66),IF(C66=\"Avion\",IF(E66<500,Références!C$10*E66,IF(E66<1600,Références!C$11*E66,IF(E66<3600,Références!C$12*E66,IF(E66>=3600,Références!C$13*E66)))),VLOOKUP(C66,Références!B$3:C$7,2)*E66)))","v":""}]
[null,57,null,null,null,{"$f":"IF(E67=\"\",\"\",IF(C67=\"Automobile\",Références!C$4*E67/IF(D67=\"\",1,D67),IF(C67=\"Avion\",IF(E67<500,Références!C$10*E67,IF(E67<1600,Références!C$11*E67,IF(E67<3600,Références!C$12*E67,IF(E67>=3600,Références!C$13*E67)))),VLOOKUP(C67,Références!B$3:C$7,2)*E67)))","v":""}]
[null,58,null,null,null,{"$f":"IF(E68=\"\",\"\",IF(C68=\"Automobile\",Références!C$4*E68/IF(D68=\"\",1,D68),IF(C68=\"Avion\",IF(E68<500,Références!C$10*E68,IF(E68<1600,Références!C$11*E68,IF(E68<3600,Références!C$12*E68,IF(E68>=3600,Références!C$13*E68)))),VLOOKUP(C68,Références!B$3:C$7,2)*E68)))","v":""}]
[null,59,null,null,null,{"$f":"IF(E69=\"\",\"\",IF(C69=\"Automobile\",Références!C$4*E69/IF(D69=\"\",1,D69),IF(C69=\"Avion\",IF(E69<500,Références!C$10*E69,IF(E69<1600,Références!C$11*E69,IF(E69<3600,Références!C$12*E69,IF(E69>=3600,Références!C$13*E69)))),VLOOKUP(C69,Références!B$3:C$7,2)*E69)))","v":""}]
[null,60,null,null,null,{"$f":"IF(E70=\"\",\"\",IF(C70=\"Automobile\",Références!C$4*E70/IF(D70=\"\",1,D70),IF(C70=\"Avion\",IF(E70<500,Références!C$10*E70,IF(E70<1600,Références!C$11*E70,IF(E70<3600,Références!C$12*E70,IF(E70>=3600,Références!C$13*E70)))),VLOOKUP(C70,Références!B$3:C$7,2)*E70)))","v":""}]
[null,61,null,null,null,{"$f":"IF(E71=\"\",\"\",IF(C71=\"Automobile\",Références!C$4*E71/IF(D71=\"\",1,D71),IF(C71=\"Avion\",IF(E71<500,Références!C$10*E71,IF(E71<1600,Références!C$11*E71,IF(E71<3600,Références!C$12*E71,IF(E71>=3600,Références!C$13*E71)))),VLOOKUP(C71,Références!B$3:C$7,2)*E71)))","v":""}]
[null,62,null,null,null,{"$f":"IF(E72=\"\",\"\",IF(C72=\"Automobile\",Références!C$4*E72/IF(D72=\"\",1,D72),IF(C72=\"Avion\",IF(E72<500,Références!C$10*E72,IF(E72<1600,Références!C$11*E72,IF(E72<3600,Références!C$12*E72,IF(E72>=3600,Références!C$13*E72)))),VLOOKUP(C72,Références!B$3:C$7,2)*E72)))","v":""}]
[null,63,null,null,null,{"$f":"IF(E73=\"\",\"\",IF(C73=\"Automobile\",Références!C$4*E73/IF(D73=\"\",1,D73),IF(C73=\"Avion\",IF(E73<500,Références!C$10*E73,IF(E73<1600,Références!C$11*E73,IF(E73<3600,Références!C$12*E73,IF(E73>=3600,Références!C$13*E73)))),VLOOKUP(C73,Références!B$3:C$7,2)*E73)))","v":""}]
[null,64,null,null,null,{"$f":"IF(E74=\"\",\"\",IF(C74=\"Automobile\",Références!C$4*E74/IF(D74=\"\",1,D74),IF(C74=\"Avion\",IF(E74<500,Références!C$10*E74,IF(E74<1600,Références!C$11*E74,IF(E74<3600,Références!C$12*E74,IF(E74>=3600,Références!C$13*E74)))),VLOOKUP(C74,Références!B$3:C$7,2)*E74)))","v":""}]
[null,65,null,null,null,{"$f":"IF(E75=\"\",\"\",IF(C75=\"Automobile\",Références!C$4*E75/IF(D75=\"\",1,D75),IF(C75=\"Avion\",IF(E75<500,Références!C$10*E75,IF(E75<1600,Références!C$11*E75,IF(E75<3600,Références!C$12*E75,IF(E75>=3600,Références!C$13*E75)))),VLOOKUP(C75,Références!B$3:C$7,2)*E75)))","v":""}]
[null,66,null,null,null,{"$f":"IF(E76=\"\",\"\",IF(C76=\"Automobile\",Références!C$4*E76/IF(D76=\"\",1,D76),IF(C76=\"Avion\",IF(E76<500,Références!C$10*E76,IF(E76<1600,Références!C$11*E76,IF(E76<3600,Références!C$12*E76,IF(E76>=3600,Références!C$13*E76)))),VLOOKUP(C76,Références!B$3:C$7,2)*E76)))","v":""}]
[null,67,null,null,null,{"$f":"IF(E77=\"\",\"\",IF(C77=\"Automobile\",Références!C$4*E77/IF(D77=\"\",1,D77),IF(C77=\"Avion\",IF(E77<500,Références!C$10*E77,IF(E77<1600,Références!C$11*E77,IF(E77<3600,Références!C$12*E77,IF(E77>=3600,Références!C$13*E77)))),VLOOKUP(C77,Références!B$3:C$7,2)*E77)))","v":""}]
[null,68,null,null,null,{"$f":"IF(E78=\"\",\"\",IF(C78=\"Automobile\",Références!C$4*E78/IF(D78=\"\",1,D78),IF(C78=\"Avion\",IF(E78<500,Références!C$10*E78,IF(E78<1600,Références!C$11*E78,IF(E78<3600,Références!C$12*E78,IF(E78>=3600,Références!C$13*E78)))),VLOOKUP(C78,Références!B$3:C$7,2)*E78)))","v":""}]
[null,69,null,null,null,{"$f":"IF(E79=\"\",\"\",IF(C79=\"Automobile\",Références!C$4*E79/IF(D79=\"\",1,D79),IF(C79=\"Avion\",IF(E79<500,Références!C$10*E79,IF(E79<1600,Références!C$11*E79,IF(E79<3600,Références!C$12*E79,IF(E79>=3600,Références!C$13*E79)))),VLOOKUP(C79,Références!B$3:C$7,2)*E79)))","v":""}]
[null,70,null,null,null,{"$f":"IF(E80=\"\",\"\",IF(C80=\"Automobile\",Références!C$4*E80/IF(D80=\"\",1,D80),IF(C80=\"Avion\",IF(E80<500,Références!C$10*E80,IF(E80<1600,Références!C$11*E80,IF(E80<3600,Références!C$12*E80,IF(E80>=3600,Références!C$13*E80)))),VLOOKUP(C80,Références!B$3:C$7,2)*E80)))","v":""}]
{"$rows_left_out":931}
{"sheet":"Références","index":1,"n_rows":28,"n_cols":5,"rows_kept":28,"cut":false,"hidden":false,"merged":[[18,1,18,2],[25,1,25,4],[26,1,26,4],[4,2,4,3]]}
[null,"Émissions selon le type de déplacements"]
[null,"Type de véhicule","Émissions CO2 éq (kg/km/personne)","Source","Remarques"]
[null,"Autobus",6.6489999999999994E-2,1]
[null,"Automobile",{"$f":"0.391555555555556/C20","v":0.24330134238270745},1,"Basé sur une consommation moyenne de 10,69 l/100 km (22,5 miles/GallonUS)"]
[null,"Avion","voir tableau ci-dessous selon les distances parcourues"]
[null,"Taxi",0.14291999999999999,1]
[null,"Train",0.11495,1]
[]
[null,"Avion"]
[null,"Avion courte distance (0-499 km)",0.17,1]
[null,"Avion moyenne distance (500-1599 km)",0.1,1]
[null,"Avion longue distance (1600-3599 km)",0.11,1]
[null,"Avion très longue distance (3600 km et +)",0.11,"1 et 3"]
[]
[]
[null,"Nombre de tonnes de CO2 fixées par arbre",0.20799999999999999]
[null,"Coûts par arbre",10]
[]
[null,"Conversions"]
[null,"km/mile",1.6093440000000001]
[null,"l/gallons US",3.7854117839999999]
[]
[]
[null,"Références:"]
[]
[null,"1- Worlds Ressources Institute et World Business Council for Sustainable Development (2017). Compilation of emission factors used in the cross-sector tools. Lien : http://www.ghgprotocol.org/calculation-tools."]
[null,"2- Environnement Canada (2012). Rapport national d’inventaire 1990-2012 : sources et puits de gaz à effet de serre au Canada. Tableau [En ligne] http://www.ec.gc.ca/pdb/ghg/inventory_report/2006_report/a12_fra.cfm."]
[null,"3- GIEC (1999). L'aviation et l'atmosphère planétaire, résumé à l'intention des décideurs. 25 p"]